insight-n
type: LexicalEntry
canonical form: insight
sense: 05716154-n
part of speech: noun
sense: 05718303-n
sense: 05815314-n
sense: 07528486-n

sixth sense-n
type: LexicalEntry
canonical form: sixth sense
sense: 05716154-n
part of speech: noun

05716154-n
type: LexicalConcept
in scheme: en-word.net
definition: grasping the inner nature of things intuitively
ili: i66908
lexfile: noun.cognition
part of speech: noun
hypernym: 05715442-n

penetration-n
type: LexicalEntry
canonical form: penetration
sense: 05718303-n
part of speech: noun

05718303-n
type: LexicalConcept
in scheme: en-word.net
definition: clear or deep perception of a situation
ili: i66919
lexfile: noun.cognition
part of speech: noun
hypernym: 05717967-n

brainstorm-n
type: LexicalEntry
canonical form: brainstorm
sense: 05815314-n
part of speech: noun

brainwave-n
type: LexicalEntry
canonical form: brainwave
sense: 05815314-n
part of speech: noun

05815314-n
type: LexicalConcept
in scheme: en-word.net
definition: the clear (and often sudden) understanding of a complex situation
ili: i67400
lexfile: noun.cognition
part of speech: noun
hypernym: 05813483-n

perceptiveness-n
type: LexicalEntry
canonical form: perceptiveness
sense: 07528486-n
part of speech: noun

perceptivity-n
type: LexicalEntry
canonical form: perceptivity
sense: 07528486-n
part of speech: noun

07528486-n
type: LexicalConcept
in scheme: en-word.net
definition: a feeling of understanding
ili: i76235
lexfile: noun.feeling
part of speech: noun
hypernym: 07528087-n