hospital-n
type: LexicalEntry
canonical form: hospital
sense: 03545775-n
part of speech: noun

infirmary-n
type: LexicalEntry
canonical form: infirmary
sense: 03545775-n
part of speech: noun

03545775-n
type: LexicalConcept
in scheme: en-word.net
definition: a health facility where patients receive treatment
ili: i54936
lexfile: noun.artifact
part of speech: noun
hypernym: 03745009-n
mero part: 02926380-n
mero part: 03047259-n
mero part: 03546271-n
mero part: 04557205-n