obligation-n
type: LexicalEntry
canonical form: obligation
sense: 13804245-n
part of speech: noun

indebtedness-n
type: LexicalEntry
canonical form: indebtedness
sense: 13804245-n
part of speech: noun
sense: 14513903-n

13804245-n
type: LexicalConcept
in scheme: en-word.net
definition: a personal relation in which one is indebted for a service or favor
ili: i109334
lexfile: noun.relation
part of speech: noun
hypernym: 13803882-n

liability-n
type: LexicalEntry
canonical form: liability
sense: 14513903-n
part of speech: noun

financial obligation-n
type: LexicalEntry
canonical form: financial obligation
sense: 14513903-n
part of speech: noun

14513903-n
type: LexicalConcept
in scheme: en-word.net
definition: an obligation to pay money to another party
ili: i113151
lexfile: noun.state
part of speech: noun
hypernym: 14513694-n