increase-n
type: LexicalEntry
canonical form: increase
sense: 05116247-n
part of speech: noun
sense: 13518338-n

increment-n
type: LexicalEntry
canonical form: increment
sense: 05116247-n
part of speech: noun
sense: 13518338-n

05116247-n
type: LexicalConcept
in scheme: en-word.net
definition: the amount by which something increases
example: they proposed an increase of 15 percent in the fare
ili: i63844
lexfile: noun.attribute
part of speech: noun
hypernym: 05115065-n

growth-n
type: LexicalEntry
canonical form: growth
sense: 13518338-n
part of speech: noun

13518338-n
type: LexicalConcept
in scheme: en-word.net
definition: a process of becoming larger or longer or more numerous or more important
example: the increase in unemployment
example: the growth of population
ili: i107658
lexfile: noun.process
part of speech: noun
hypernym: 00029976-n