in situ-r
type: LexicalEntry
canonical form: in situ
sense: 00257669-r
part of speech: adverb

in place-r
type: LexicalEntry
canonical form: in place
sense: 00257669-r
part of speech: adverb

00257669-r
type: LexicalConcept
in scheme: en-word.net
definition: in the original or natural place or site
example: carcinoma in situ
example: the archeologists left the pottery in place
ili: i19919
lexfile: adv.all
part of speech: adverb