improbable-a
type: LexicalEntry
canonical form: improbable
sense: 00649139-s
part of speech: adjective
sense: https://en-word.net/lemma/improbable-a#01416708-a
sense: 01805119-s

marvelous-a
type: LexicalEntry
canonical form: marvelous
sense: 00649139-s
part of speech: adjective

marvellous-a
type: LexicalEntry
canonical form: marvellous
sense: 00649139-s
part of speech: adjective

tall-a
type: LexicalEntry
canonical form: tall
sense: 00649139-s
part of speech: adjective

00649139-s
type: LexicalConcept
in scheme: en-word.net
definition: too improbable to admit of belief
example: a tall story
ili: i3591
lexfile: adj.all
part of speech: adjective satellite
similar: https://en-word.net/synset/00648515-a

unlikely-a
type: LexicalEntry
canonical form: unlikely
sense: https://en-word.net/lemma/unlikely-a#01416708-a
part of speech: adjective
sense: 01805119-s

https://en-word.net/synset/01416708-a
type: LexicalConcept
in scheme: en-word.net
definition: not likely to be true or to occur or to have occurred
example: legislation on the question is highly unlikely
example: an improbable event
ili: i7712
lexfile: adj.all
part of speech: adjective
similar: 01416974-s

unbelievable-a
type: LexicalEntry
canonical form: unbelievable
sense: 01805119-s
part of speech: adjective

unconvincing-a
type: LexicalEntry
canonical form: unconvincing
sense: 01805119-s
part of speech: adjective

01805119-s
type: LexicalConcept
in scheme: en-word.net
definition: having a probability too low to inspire belief
ili: i9891
lexfile: adj.all
part of speech: adjective satellite
similar: https://en-word.net/synset/01804481-a