impatience-n
type: LexicalEntry
canonical form: impatience
sense: 04649953-n
part of speech: noun
sense: 07529310-n
sense: 14430687-n

04649953-n
type: LexicalConcept
in scheme: en-word.net
definition: a dislike of anything that causes delay
ili: i61469
lexfile: noun.attribute
part of speech: noun
hypernym: 04648804-n

07529310-n
type: LexicalConcept
in scheme: en-word.net
definition: a restless desire for change and excitement
ili: i76240
lexfile: noun.feeling
part of speech: noun
hypernym: 07529034-n

restlessness-n
type: LexicalEntry
canonical form: restlessness
sense: 14430687-n
part of speech: noun

14430687-n
type: LexicalConcept
in scheme: en-word.net
definition: a lack of patience; irritation with anything that causes delay
ili: i112719
lexfile: noun.state
part of speech: noun
hypernym: 14429977-n