exemption-n
type: LexicalEntry
canonical form: exemption
sense: 00214770-n
part of speech: noun

immunity-n
type: LexicalEntry
canonical form: immunity
sense: 00214770-n
part of speech: noun
sense: 05041061-n
sense: 14550366-n
sense: 14550773-n

granting immunity-n
type: LexicalEntry
canonical form: granting immunity
sense: 00214770-n
part of speech: noun

00214770-n
type: LexicalConcept
in scheme: en-word.net
definition: an act exempting someone
example: he was granted immunity from prosecution
ili: i36529
lexfile: noun.act
part of speech: noun
hypernym: 00214561-n

05041061-n
type: LexicalConcept
in scheme: en-word.net
definition: the quality of being unaffected by something
example: immunity to criticism
ili: i63456
lexfile: noun.attribute
part of speech: noun
hypernym: 05040836-n

unsusceptibility-n
type: LexicalEntry
canonical form: unsusceptibility
sense: 14550366-n
part of speech: noun

14550366-n
type: LexicalConcept
in scheme: en-word.net
definition: the state of not being susceptible
example: unsusceptibility to rust
ili: i113342
lexfile: noun.state
part of speech: noun
hypernym: 13943868-n

resistance-n
type: LexicalEntry
canonical form: resistance
sense: 14550773-n
part of speech: noun

14550773-n
type: LexicalConcept
in scheme: en-word.net
definition: (medicine) the condition in which an organism can resist disease
ili: i113344
lexfile: noun.state
part of speech: noun
domain topic: 06052606-n
hypernym: 13943868-n