ideology-n
type: LexicalEntry
canonical form: ideology
sense: 05787565-n
part of speech: noun
sense: 06222574-n

05787565-n
type: LexicalConcept
in scheme: en-word.net
definition: imaginary or visionary theorization
ili: i67260
lexfile: noun.cognition
part of speech: noun
hypernym: 05787368-n

political orientation-n
type: LexicalEntry
canonical form: political orientation
sense: 06222574-n
part of speech: noun

political theory-n
type: LexicalEntry
canonical form: political theory
sense: 06222574-n
part of speech: noun

06222574-n
type: LexicalConcept
in scheme: en-word.net
definition: an orientation that characterizes the thinking of a group or nation
ili: i69182
lexfile: noun.cognition
part of speech: noun
attribute: https://en-word.net/synset/00576723-a
attribute: https://en-word.net/synset/00577581-a
hypernym: 06217756-n