hydrate-v
type: LexicalEntry
canonical form: hydrate
sense: 00214446-v
part of speech: verb
sense: 00214694-v
sense: 00214833-v

00214446-v
type: LexicalConcept
in scheme: en-word.net
definition: cause to be hydrated; add water or moisture to
example: hydrate your skin
ili: i22789
lexfile: verb.change
part of speech: verb
hypernym: 00216226-v
similar: 00214694-v
similar: 00214833-v

00214694-v
type: LexicalConcept
in scheme: en-word.net
definition: become hydrated and combine with water
ili: i22790
lexfile: verb.change
part of speech: verb
hypernym: 00109468-v
similar: 00214446-v

00214833-v
type: LexicalConcept
in scheme: en-word.net
definition: supply water or liquid to in order to maintain a healthy balance
example: the bicyclists must be hydrated frequently
ili: i22791
lexfile: verb.change
part of speech: verb
hypernym: 02332196-v
similar: 00214446-v

hydrate-n
type: LexicalEntry
canonical form: hydrate
sense: 14934591-n
part of speech: noun

14934591-n
type: LexicalConcept
in scheme: en-word.net
definition: any compound that contains water of crystallization
ili: i115445
lexfile: noun.substance
part of speech: noun
hypernym: 14842408-n