humility-n
type: LexicalEntry
canonical form: humility
sense: 04896722-n
part of speech: noun
sense: 07524370-n

humbleness-n
type: LexicalEntry
canonical form: humbleness
sense: 04896722-n
part of speech: noun
sense: 07524370-n

04896722-n
type: LexicalConcept
in scheme: en-word.net
definition: a disposition to be humble; a lack of false pride
example: not everyone regards humility as a virtue
ili: i62683
lexfile: noun.attribute
part of speech: noun
attribute: https://en-word.net/synset/01899020-a
hypernym: 04623416-n

07524370-n
type: LexicalConcept
in scheme: en-word.net
definition: a humble feeling
example: he was filled with humility at the sight of the Pope
ili: i76210
lexfile: noun.feeling
part of speech: noun
hypernym: 00026390-n