hosiery-n
type: LexicalEntry
canonical form: hosiery
sense: 03545447-n
part of speech: noun

hose-n
type: LexicalEntry
canonical form: hose
sense: 03545447-n
part of speech: noun

03545447-n
type: LexicalConcept
in scheme: en-word.net
definition: socks and stockings and tights collectively (the British include underwear)
ili: i54934
lexfile: noun.artifact
part of speech: noun
domain region: 08879115-n
hypernym: 03385972-n