honeymoon-v
type: LexicalEntry
canonical form: honeymoon
sense: 02714797-v
part of speech: verb

02714797-v
type: LexicalConcept
in scheme: en-word.net
definition: spend a holiday after one's marriage
example: they plan to honeymoon in Hawai'i
ili: i35205
lexfile: verb.stative
part of speech: verb
hypernym: 02714581-v

honeymoon-n
type: LexicalEntry
canonical form: honeymoon
sense: 15163863-n
part of speech: noun
sense: 15319031-n

15163863-n
type: LexicalConcept
in scheme: en-word.net
definition: a holiday taken by a newly married couple
ili: i116756
lexfile: noun.time
part of speech: noun
hypernym: 15162842-n

15319031-n
type: LexicalConcept
in scheme: en-word.net
definition: the early (usually calm and harmonious) period of a relationship; business or political
ili: i117623
lexfile: noun.time
part of speech: noun
hypernym: 15137796-n