honeycomb-v
type: LexicalEntry
canonical form: honeycomb
sense: 00534853-v
part of speech: verb
sense: 01232373-v
sense: 01755970-v

00534853-v
type: LexicalConcept
in scheme: en-word.net
definition: make full of cavities, like a honeycomb
ili: i24394
lexfile: verb.change
part of speech: verb
hypernym: 00126072-v

01232373-v
type: LexicalConcept
in scheme: en-word.net
definition: penetrate thoroughly and into every part
example: the revolutionaries honeycombed the organization
ili: i27771
lexfile: verb.contact
part of speech: verb
hypernym: 01230239-v

01755970-v
type: LexicalConcept
in scheme: en-word.net
definition: carve a honeycomb pattern into
example: The cliffs were honeycombed
ili: i30500
lexfile: verb.creation
part of speech: verb
hypernym: 01755833-v

honeycomb-n
type: LexicalEntry
canonical form: honeycomb
sense: 03535822-n
part of speech: noun
sense: 09241222-n

03535822-n
type: LexicalConcept
in scheme: en-word.net
definition: a framework of hexagonal cells resembling the honeycomb built by bees
ili: i54874
lexfile: noun.artifact
part of speech: noun
hypernym: 03396616-n

09241222-n
type: LexicalConcept
in scheme: en-word.net
definition: a structure of small hexagonal cells constructed from beeswax by bees and used to store honey and larvae
ili: i85065
lexfile: noun.object
part of speech: noun
hypernym: 04348764-n