highlight-v
type: LexicalEntry
canonical form: highlight
sense: 00040937-v
part of speech: verb
sense: 00515150-v

00040937-v
type: LexicalConcept
in scheme: en-word.net
definition: apply a highlighter to one's cheeks or eyebrows in order to make them more prominent
example: highlight the area above your eyebrows
ili: i21973
lexfile: verb.body
part of speech: verb
hypernym: 00040659-v

foreground-v
type: LexicalEntry
canonical form: foreground
sense: 00515150-v
part of speech: verb

spotlight-v
type: LexicalEntry
canonical form: spotlight
sense: 00515150-v
part of speech: verb

play up-v
type: LexicalEntry
canonical form: play up
sense: 00515150-v
part of speech: verb

00515150-v
type: LexicalConcept
in scheme: en-word.net
definition: move into the foreground to make more visible or prominent
example: The introduction highlighted the speaker's distinguished career in linguistics
ili: i24289
lexfile: verb.change
part of speech: verb
hypernym: 00515544-v

highlight-n
type: LexicalEntry
canonical form: highlight
sense: 04959297-n
part of speech: noun
sense: 13832353-n

highlighting-n
type: LexicalEntry
canonical form: highlighting
sense: 04959297-n
part of speech: noun

04959297-n
type: LexicalConcept
in scheme: en-word.net
definition: an area of lightness in a picture
ili: i63004
lexfile: noun.attribute
part of speech: noun
hypernym: 04958550-n

high spot-n
type: LexicalEntry
canonical form: high spot
sense: 13832353-n
part of speech: noun

13832353-n
type: LexicalConcept
in scheme: en-word.net
definition: the most interesting or memorable part
example: the highlight of the tour was our visit to the Vatican
ili: i109478
lexfile: noun.relation
part of speech: noun
hypernym: 13832132-n