inheritance-n
type: LexicalEntry
canonical form: inheritance
sense: 00084405-n
part of speech: noun
sense: 04928188-n
sense: 13283812-n

heritage-n
type: LexicalEntry
canonical form: heritage
sense: 00084405-n
part of speech: noun
sense: 04928188-n
sense: 05677641-n
sense: 13283812-n

00084405-n
type: LexicalConcept
in scheme: en-word.net
definition: hereditary succession to a title or an office or property
ili: i35846
lexfile: noun.act
part of speech: noun
hypernym: 00078239-n

04928188-n
type: LexicalConcept
in scheme: en-word.net
definition: any attribute or immaterial possession that is inherited from ancestors
example: my only inheritance was my mother's blessing
example: the world's heritage of knowledge
ili: i62843
lexfile: noun.attribute
part of speech: noun
hypernym: 00024444-n

05677641-n
type: LexicalConcept
in scheme: en-word.net
definition: practices that are handed down from the past by tradition
example: a heritage of freedom
ili: i66712
lexfile: noun.cognition
part of speech: noun
hypernym: 05675040-n

13283812-n
type: LexicalConcept
in scheme: en-word.net
definition: that which is inherited; a title or property or estate that passes by law to the heir on the death of the owner
ili: i106351
lexfile: noun.possession
part of speech: noun
domain topic: 08458195-n
hypernym: 13273872-n
mero part: 13285693-n