health-n
type: LexicalEntry
canonical form: health
sense: 13946812-n
part of speech: noun
sense: 14471374-n

13946812-n
type: LexicalConcept
in scheme: en-word.net
definition: the general condition of body and mind
example: his delicate health
example: in poor health
ili: i110114
lexfile: noun.state
part of speech: noun
hypernym: 13943868-n

wellness-n
type: LexicalEntry
canonical form: wellness
sense: 14471374-n
part of speech: noun

14471374-n
type: LexicalConcept
in scheme: en-word.net
definition: a healthy state of wellbeing free from disease
example: physicians should be held responsible for the health of their patients
ili: i112933
lexfile: noun.state
part of speech: noun
attribute: https://en-word.net/synset/01173787-a
attribute: https://en-word.net/synset/01176433-a
hypernym: 14470991-n