oral sex-n
type: LexicalEntry
canonical form: oral sex
sense: 00856505-n
part of speech: noun

head-n
type: LexicalEntry
canonical form: head
sense: 00856505-n
part of speech: noun
sense: 01320872-n
sense: 03254982-n
sense: 03506432-n
sense: 03506664-n
sense: 03506758-n
sense: 03506955-n
sense: 04065833-n
sense: 05298255-n
sense: 05546258-n
sense: 05603592-n
sense: 05619057-n
sense: 06302589-n
sense: 06355341-n
sense: 06796625-n
sense: 06834918-n
sense: 07387379-n
sense: 07433422-n
sense: 08499282-n
sense: 08525470-n
sense: 08590014-n
sense: 08681922-n
sense: 09324750-n
sense: 09324937-n
sense: 09422467-n
sense: 10182373-n
sense: 10182584-n
sense: 10182947-n
sense: 10494230-n
sense: 11516007-n
sense: 13154545-n
sense: 13675998-n
sense: 14335908-n

00856505-n
type: LexicalConcept
in scheme: en-word.net
definition: oral stimulation of the genitals
example: they say he gives good head
ili: i39888
lexfile: noun.act
part of speech: noun
domain topic: 00845915-n
hypernym: 00856347-n

01320872-n
type: LexicalConcept
in scheme: en-word.net
definition: a single domestic animal
example: 200 head of cattle
ili: i42274
lexfile: noun.animal
part of speech: noun
hypernym: 01320032-n

head-v
type: LexicalEntry
canonical form: head
sense: 01593836-v
part of speech: verb
sense: 01935739-v
sense: 01939092-v
sense: 02003455-v
sense: 02445109-v
sense: 02630209-v
sense: 02700129-v
sense: 02734898-v
sense: 02760338-v

01593836-v
type: LexicalConcept
in scheme: en-word.net
definition: remove the head of
example: head the fish
ili: i29686
lexfile: verb.contact
part of speech: verb
hypernym: 00173351-v

steer-v
type: LexicalEntry
canonical form: steer
sense: 01935739-v
part of speech: verb

maneuver-v
type: LexicalEntry
canonical form: maneuver
sense: 01935739-v
part of speech: verb

manoeuver-v
type: LexicalEntry
canonical form: manoeuver
sense: 01935739-v
part of speech: verb

manoeuvre-v
type: LexicalEntry
canonical form: manoeuvre
sense: 01935739-v
part of speech: verb

direct-v
type: LexicalEntry
canonical form: direct
sense: 01935739-v
part of speech: verb

point-v
type: LexicalEntry
canonical form: point
sense: 01935739-v
part of speech: verb

guide-v
type: LexicalEntry
canonical form: guide
sense: 01935739-v
part of speech: verb

channelize-v
type: LexicalEntry
canonical form: channelize
sense: 01935739-v
part of speech: verb

channelise-v
type: LexicalEntry
canonical form: channelise
sense: 01935739-v
part of speech: verb

01935739-v
type: LexicalConcept
in scheme: en-word.net
definition: direct the course; determine the direction of travelling
ili: i31378
lexfile: verb.motion
part of speech: verb
hypernym: 02445887-v

01939092-v
type: LexicalConcept
in scheme: en-word.net
definition: to go or travel towards
example: where is she heading?
example: We were headed for the mountains
ili: i31395
lexfile: verb.motion
part of speech: verb
hypernym: 01999581-v

lead-v
type: LexicalEntry
canonical form: lead
sense: 02003455-v
part of speech: verb
sense: 02445109-v

02003455-v
type: LexicalConcept
in scheme: en-word.net
definition: travel in front of; go in advance of others
example: The procession was headed by John
ili: i31736
lexfile: verb.motion
part of speech: verb
hypernym: 02003250-v
similar: 02734898-v

02445109-v
type: LexicalConcept
in scheme: en-word.net
definition: be in charge of
example: Who is heading this project?
ili: i33926
lexfile: verb.social
part of speech: verb
hypernym: 02444366-v

02630209-v
type: LexicalConcept
in scheme: en-word.net
definition: form a head or come or grow to a head
example: The wheat headed early this year
ili: i34793
lexfile: verb.stative
part of speech: verb
hypernym: 00144670-v

02700129-v
type: LexicalConcept
in scheme: en-word.net
definition: be in the front of or on top of
example: The list was headed by the name of the president
ili: i35127
lexfile: verb.stative
part of speech: verb
hypernym: 02696550-v

head up-v
type: LexicalEntry
canonical form: head up
sense: 02734898-v
part of speech: verb

02734898-v
type: LexicalConcept
in scheme: en-word.net
definition: be the first or leading member of (a group) and excel
example: This student heads the class
ili: i35309
lexfile: verb.stative
part of speech: verb
hypernym: 02445109-v
similar: 02003455-v

02760338-v
type: LexicalConcept
in scheme: en-word.net
definition: take its rise
example: These rivers head from a mountain range in the Himalayas
ili: i35451
lexfile: verb.stative
part of speech: verb
hypernym: 02630344-v

drumhead-n
type: LexicalEntry
canonical form: drumhead
sense: 03254982-n
part of speech: noun

03254982-n
type: LexicalConcept
in scheme: en-word.net
definition: a membrane that is stretched taut over a drum
ili: i53212
lexfile: noun.artifact
part of speech: noun
hypernym: 03749252-n

03506432-n
type: LexicalConcept
in scheme: en-word.net
definition: a projection out from one end
example: the head of the nail
example: a pinhead is the head of a pin
ili: i54699
lexfile: noun.artifact
part of speech: noun
hypernym: 04015323-n

03506664-n
type: LexicalConcept
in scheme: en-word.net
definition: (nautical) a toilet on board a boat or ship
ili: i54700
lexfile: noun.artifact
part of speech: noun
hypernym: 04453410-n

03506758-n
type: LexicalConcept
in scheme: en-word.net
definition: the striking part of a tool
example: the head of the hammer
ili: i54701
lexfile: noun.artifact
part of speech: noun
hypernym: 04344878-n
mero part: 03318818-n

03506955-n
type: LexicalConcept
in scheme: en-word.net
definition: (usually plural) the obverse side of a coin that usually bears the representation of a person's head
example: call heads or tails!
ili: i54702
lexfile: noun.artifact
part of speech: noun
exemplifies: 06306016-n
hypernym: 03846027-n

read/write head-n
type: LexicalEntry
canonical form: read/write head
sense: 04065833-n
part of speech: noun

04065833-n
type: LexicalConcept
in scheme: en-word.net
definition: (computer science) a tiny electromagnetic coil and metal pole used to write and read magnetic patterns on a disk
ili: i57991
lexfile: noun.artifact
part of speech: noun
domain topic: 06138021-n
hypernym: 03069712-n

05298255-n
type: LexicalConcept
in scheme: en-word.net
definition: that part of a skeletal muscle that is away from the bone that it moves
ili: i64759
lexfile: noun.body
part of speech: noun
hypernym: 05232895-n

caput-n
type: LexicalEntry
canonical form: caput
sense: 05546258-n
part of speech: noun

05546258-n
type: LexicalConcept
in scheme: en-word.net
definition: the upper part of the human body or the front part of the body in animals; contains the face and brains
example: he stuck his head out the window
ili: i66025
lexfile: noun.body
part of speech: noun
hypernym: 05232383-n
mero part: 02455095-n
mero part: 05328447-n
mero part: 05345958-n
mero part: 05488747-n
mero part: 05547754-n
mero part: 05608392-n
mero part: 05610438-n

05603592-n
type: LexicalConcept
in scheme: en-word.net
definition: the rounded end of a bone that fits into a rounded cavity in another bone to form a joint
example: the head of the humerus
ili: i66318
lexfile: noun.body
part of speech: noun
hypernym: 05232895-n

mind-n
type: LexicalEntry
canonical form: mind
sense: 05619057-n
part of speech: noun

brain-n
type: LexicalEntry
canonical form: brain
sense: 05619057-n
part of speech: noun

psyche-n
type: LexicalEntry
canonical form: psyche
sense: 05619057-n
part of speech: noun

nous-n
type: LexicalEntry
canonical form: nous
sense: 05619057-n
part of speech: noun

05619057-n
type: LexicalConcept
in scheme: en-word.net
definition: that which is responsible for one's thoughts, feelings, and conscious brain functions; the seat of the faculty of reason
example: his mind wandered
example: I couldn't get his words out of my head
ili: i66397
lexfile: noun.cognition
part of speech: noun
hypernym: 00023451-n

head word-n
type: LexicalEntry
canonical form: head word
sense: 06302589-n
part of speech: noun

06302589-n
type: LexicalConcept
in scheme: en-word.net
definition: (grammar) the word in a grammatical constituent that plays the same grammatical role as the whole constituent
ili: i69563
lexfile: noun.communication
part of speech: noun
domain topic: 06184139-n
hypernym: 06297048-n

heading-n
type: LexicalEntry
canonical form: heading
sense: 06355341-n
part of speech: noun

header-n
type: LexicalEntry
canonical form: header
sense: 06355341-n
part of speech: noun

06355341-n
type: LexicalConcept
in scheme: en-word.net
definition: a line of text serving to indicate what the passage below it is about
example: the heading seemed to have little to do with the text
ili: i69818
lexfile: noun.communication
part of speech: noun
hypernym: 07025650-n

question-n
type: LexicalEntry
canonical form: question
sense: 06796625-n
part of speech: noun

06796625-n
type: LexicalConcept
in scheme: en-word.net
definition: the subject matter at issue
example: the question of disease merits serious discussion
example: under the head of minor Roman poets
ili: i72136
lexfile: noun.communication
part of speech: noun
hypernym: 06612141-n

point-n
type: LexicalEntry
canonical form: point
sense: 06834918-n
part of speech: noun

06834918-n
type: LexicalConcept
in scheme: en-word.net
definition: a V-shaped mark at one end of an arrow pointer
example: the point of the arrow was due north
ili: i72343
lexfile: noun.communication
part of speech: noun
hypernym: 06830640-n

headway-n
type: LexicalEntry
canonical form: headway
sense: 07387379-n
part of speech: noun

07387379-n
type: LexicalConcept
in scheme: en-word.net
definition: forward movement
example: the ship made little headway against the gale
ili: i75433
lexfile: noun.event
part of speech: noun
hypernym: 07459865-n

pass-n
type: LexicalEntry
canonical form: pass
sense: 07433422-n
part of speech: noun

straits-n
type: LexicalEntry
canonical form: straits
sense: 07433422-n
part of speech: noun

07433422-n
type: LexicalConcept
in scheme: en-word.net
definition: a difficult juncture
example: a pretty pass
example: matters came to a head yesterday
ili: i75697
lexfile: noun.event
part of speech: noun
hypernym: 07431314-n

08499282-n
type: LexicalConcept
in scheme: en-word.net
definition: the front of a military formation or procession
example: the head of the column advanced boldly
example: they were at the head of the attack
ili: i81627
lexfile: noun.group
part of speech: noun
domain topic: 08215965-n
hypernym: 08443418-n

fountainhead-n
type: LexicalEntry
canonical form: fountainhead
sense: 08525470-n
part of speech: noun

headspring-n
type: LexicalEntry
canonical form: headspring
sense: 08525470-n
part of speech: noun

08525470-n
type: LexicalConcept
in scheme: en-word.net
definition: the source of water from which a stream arises
example: they tracked him back toward the head of the stream
ili: i81762
lexfile: noun.location
part of speech: noun
hypernym: 08524579-n

forefront-n
type: LexicalEntry
canonical form: forefront
sense: 08590014-n
part of speech: noun

08590014-n
type: LexicalConcept
in scheme: en-word.net
definition: the part in the front or nearest the viewer
example: he was in the forefront
example: he was at the head of the column
ili: i82034
lexfile: noun.location
part of speech: noun
hypernym: 08591019-n

08681922-n
type: LexicalConcept
in scheme: en-word.net
definition: the top of something
example: the head of the stairs
example: the head of the page
example: the head of the list
ili: i82499
lexfile: noun.location
part of speech: noun
hypernym: 08681598-n

09324750-n
type: LexicalConcept
in scheme: en-word.net
definition: the foam or froth that accumulates at the top when you pour an effervescent liquid into a container
example: the beer had a large head of foam
ili: i85518
lexfile: noun.object
part of speech: noun
hypernym: 09305630-n

09324937-n
type: LexicalConcept
in scheme: en-word.net
definition: a rounded compact mass
example: the head of a comet
ili: i85519
lexfile: noun.object
part of speech: noun
hypernym: 00002684-n

promontory-n
type: LexicalEntry
canonical form: promontory
sense: 09422467-n
part of speech: noun

headland-n
type: LexicalEntry
canonical form: headland
sense: 09422467-n
part of speech: noun

foreland-n
type: LexicalEntry
canonical form: foreland
sense: 09422467-n
part of speech: noun

09422467-n
type: LexicalConcept
in scheme: en-word.net
definition: a natural elevation (especially a rocky one that juts out into the sea)
ili: i86014
lexfile: noun.object
part of speech: noun
hypernym: 09389214-n

10182373-n
type: LexicalConcept
in scheme: en-word.net
definition: a user of (usually soft) drugs
example: the office was full of secret heads
ili: i90430
lexfile: noun.person
part of speech: noun
exemplifies: 07089193-n
hypernym: 10055991-n

chief-n
type: LexicalEntry
canonical form: chief
sense: 10182584-n
part of speech: noun

top dog-n
type: LexicalEntry
canonical form: top dog
sense: 10182584-n
part of speech: noun

10182584-n
type: LexicalConcept
in scheme: en-word.net
definition: a person who is in charge
example: the head of the whole operation
ili: i90431
lexfile: noun.person
part of speech: noun
hypernym: 09646208-n

10182947-n
type: LexicalConcept
in scheme: en-word.net
definition: an individual person
example: tickets are $5 per head
ili: i90432
lexfile: noun.person
part of speech: noun
hypernym: 10223458-n

principal-n
type: LexicalEntry
canonical form: principal
sense: 10494230-n
part of speech: noun

school principal-n
type: LexicalEntry
canonical form: school principal
sense: 10494230-n
part of speech: noun

head teacher-n
type: LexicalEntry
canonical form: head teacher
sense: 10494230-n
part of speech: noun

10494230-n
type: LexicalConcept
in scheme: en-word.net
definition: the educator who has executive authority for a school
example: she sent unruly pupils to see the principal
ili: i92250
lexfile: noun.person
part of speech: noun
hypernym: 10065521-n

11516007-n
type: LexicalConcept
in scheme: en-word.net
definition: the pressure exerted by a fluid
example: a head of steam
ili: i98003
lexfile: noun.phenomenon
part of speech: noun
hypernym: 11515441-n

capitulum-n
type: LexicalEntry
canonical form: capitulum
sense: 13154545-n
part of speech: noun

13154545-n
type: LexicalConcept
in scheme: en-word.net
definition: a dense cluster of flowers or foliage
example: a head of cauliflower
example: a head of lettuce
ili: i105669
lexfile: noun.plant
part of speech: noun
hypernym: 13108385-n

13675998-n
type: LexicalConcept
in scheme: en-word.net
definition: the length or height based on the size of a human or animal head
example: he is two heads taller than his little sister
example: his horse won by a head
ili: i108466
lexfile: noun.quantity
part of speech: noun
hypernym: 13624548-n

14335908-n
type: LexicalConcept
in scheme: en-word.net
definition: the tip of an abscess (where the pus accumulates)
ili: i112158
lexfile: noun.state
part of speech: noun
hypernym: 13925175-n