coincidence-n
type: LexicalEntry
canonical form: coincidence
sense: 07331599-n
part of speech: noun

happenstance-n
type: LexicalEntry
canonical form: happenstance
sense: 07331599-n
part of speech: noun

07331599-n
type: LexicalConcept
in scheme: en-word.net
definition: an event that might have been arranged although it was really accidental
ili: i75140
lexfile: noun.event
part of speech: noun
hypernym: 07315578-n