handiness-n
type: LexicalEntry
canonical form: handiness
sense: 04726275-n
part of speech: noun
sense: 05648769-n

accessibility-n
type: LexicalEntry
canonical form: accessibility
sense: 04726275-n
part of speech: noun

availability-n
type: LexicalEntry
canonical form: availability
sense: 04726275-n
part of speech: noun

availableness-n
type: LexicalEntry
canonical form: availableness
sense: 04726275-n
part of speech: noun

04726275-n
type: LexicalConcept
in scheme: en-word.net
definition: the quality of being at hand when needed
ili: i61847
lexfile: noun.attribute
part of speech: noun
attribute: https://en-word.net/synset/00019169-a
attribute: https://en-word.net/synset/00019912-a
attribute: https://en-word.net/synset/00184353-a
attribute: https://en-word.net/synset/00187221-a
hypernym: 04725839-n

05648769-n
type: LexicalConcept
in scheme: en-word.net
definition: skillfulness with the hands
example: he can do any sort of work requiring handiness and dexterity
ili: i66559
lexfile: noun.cognition
part of speech: noun
hypernym: 05648278-n