haircloth-n
type: LexicalEntry
canonical form: haircloth
sense: 03480797-n
part of speech: noun

hair-n
type: LexicalEntry
canonical form: hair
sense: 03480797-n
part of speech: noun

03480797-n
type: LexicalConcept
in scheme: en-word.net
definition: cloth woven from horsehair or camelhair; used for upholstery or stiffening in garments
ili: i54545
lexfile: noun.artifact
part of speech: noun
hypernym: 03314753-n