groan-v
type: LexicalEntry
canonical form: groan
sense: 01047291-v
part of speech: verb

moan-v
type: LexicalEntry
canonical form: moan
sense: 01047291-v
part of speech: verb

01047291-v
type: LexicalConcept
in scheme: en-word.net
definition: indicate pain, discomfort, or displeasure
example: The students groaned when the professor got out the exam booklets
example: The ancient door moaned when opened
ili: i26799
lexfile: verb.communication
part of speech: verb
hypernym: 00985856-v

groan-n
type: LexicalEntry
canonical form: groan
sense: 07141091-n
part of speech: noun

moan-n
type: LexicalEntry
canonical form: moan
sense: 07141091-n
part of speech: noun

07141091-n
type: LexicalConcept
in scheme: en-word.net
definition: an utterance expressing pain or disapproval
ili: i74109
lexfile: noun.communication
part of speech: noun
hypernym: 07124555-n