graphics-n
type: LexicalEntry
canonical form: graphics
sense: 03458929-n
part of speech: noun
sense: 07011408-n

03458929-n
type: LexicalConcept
in scheme: en-word.net
definition: the drawings and photographs in the layout of a book
ili: i54403
lexfile: noun.artifact
part of speech: noun
hypernym: 03458753-n

artwork-n
type: LexicalEntry
canonical form: artwork
sense: 07011408-n
part of speech: noun

art-n
type: LexicalEntry
canonical form: art
sense: 07011408-n
part of speech: noun

nontextual matter-n
type: LexicalEntry
canonical form: nontextual matter
sense: 07011408-n
part of speech: noun

07011408-n
type: LexicalConcept
in scheme: en-word.net
definition: photographs or other visual representations in a printed publication
example: the publisher was responsible for all the artwork in the book
ili: i73438
lexfile: noun.communication
part of speech: noun
hypernym: 06886302-n