goose step-n
type: LexicalEntry
canonical form: goose step
sense: 00291998-n
part of speech: noun

00291998-n
type: LexicalConcept
in scheme: en-word.net
definition: a manner of marching with legs straight and swinging high
ili: i36927
lexfile: noun.act
part of speech: noun
hypernym: 00291423-n

goose step-v
type: LexicalEntry
canonical form: goose step
sense: 01933086-v
part of speech: verb

01933086-v
type: LexicalConcept
in scheme: en-word.net
definition: march in a military fashion
ili: i31364
lexfile: verb.motion
part of speech: verb
hypernym: 02000767-v