golf-n
type: LexicalEntry
canonical form: golf
sense: 00465962-n
part of speech: noun

golf game-n
type: LexicalEntry
canonical form: golf game
sense: 00465962-n
part of speech: noun

00465962-n
type: LexicalConcept
in scheme: en-word.net
definition: a game played on a large open course with 9 or 18 holes; the object is use as few strokes as possible in playing all the holes
ili: i37860
lexfile: noun.act
part of speech: noun
hypernym: 00465719-n

golf-v
type: LexicalEntry
canonical form: golf
sense: 01149259-v
part of speech: verb

01149259-v
type: LexicalConcept
in scheme: en-word.net
definition: play golf
ili: i27354
lexfile: verb.competition
part of speech: verb
hypernym: 01075360-v