beget-v
type: LexicalEntry
canonical form: beget
sense: 00054345-v
part of speech: verb

get-v
type: LexicalEntry
canonical form: get
sense: 00054345-v
part of speech: verb
sense: 00065410-v
sense: 00087488-v
sense: 00094214-v
sense: 00120124-v
sense: 00120604-v
sense: 00149403-v
sense: 00346415-v
sense: 00523831-v
sense: 00591299-v
sense: 00624056-v
sense: 00641511-v
sense: 00772482-v
sense: 01028984-v
sense: 01068058-v
sense: 01156413-v
sense: 01217985-v
sense: 01403769-v
sense: 01435927-v
sense: 01508590-v
sense: 01567992-v
sense: 01646839-v
sense: 01741988-v
sense: 01774960-v
sense: 01775115-v
sense: 02009962-v
sense: 02010587-v
sense: 02014716-v
sense: 02112480-v
sense: 02113108-v
sense: 02114099-v
sense: 02193844-v
sense: 02213047-v
sense: 02215637-v
sense: 02360592-v
sense: 02364339-v

engender-v
type: LexicalEntry
canonical form: engender
sense: 00054345-v
part of speech: verb

father-v
type: LexicalEntry
canonical form: father
sense: 00054345-v
part of speech: verb

mother-v
type: LexicalEntry
canonical form: mother
sense: 00054345-v
part of speech: verb

sire-v
type: LexicalEntry
canonical form: sire
sense: 00054345-v
part of speech: verb

generate-v
type: LexicalEntry
canonical form: generate
sense: 00054345-v
part of speech: verb

bring forth-v
type: LexicalEntry
canonical form: bring forth
sense: 00054345-v
part of speech: verb

00054345-v
type: LexicalConcept
in scheme: en-word.net
definition: make (offspring) by reproduction
example: Abraham begot Isaac
example: John fathered four daughters
ili: i22046
lexfile: verb.body
part of speech: verb
hypernym: 01620211-v

suffer-v
type: LexicalEntry
canonical form: suffer
sense: 00065410-v
part of speech: verb

sustain-v
type: LexicalEntry
canonical form: sustain
sense: 00065410-v
part of speech: verb

have-v
type: LexicalEntry
canonical form: have
sense: 00065410-v
part of speech: verb
sense: 00120604-v
sense: 00772482-v
sense: 02112480-v
sense: 02360592-v

00065410-v
type: LexicalConcept
in scheme: en-word.net
definition: undergo (as of injuries and illnesses)
example: She suffered a fracture in the accident
example: He had an insulin shock after eating three candy bars
example: She got a bruise on her leg
example: He got his arm broken in the scuffle
ili: i22105
lexfile: verb.body
part of speech: verb
hypernym: 02112480-v
similar: 00065141-v

contract-v
type: LexicalEntry
canonical form: contract
sense: 00087488-v
part of speech: verb

take-v
type: LexicalEntry
canonical form: take
sense: 00087488-v
part of speech: verb

00087488-v
type: LexicalConcept
in scheme: en-word.net
definition: be stricken by an illness, fall victim to an illness
example: He got AIDS
example: She came down with pneumonia
example: She took a chill
ili: i22208
lexfile: verb.body
part of speech: verb
hypernym: 00087206-v
similar: 00087740-v

grow-v
type: LexicalEntry
canonical form: grow
sense: 00094214-v
part of speech: verb

develop-v
type: LexicalEntry
canonical form: develop
sense: 00094214-v
part of speech: verb

produce-v
type: LexicalEntry
canonical form: produce
sense: 00094214-v
part of speech: verb

acquire-v
type: LexicalEntry
canonical form: acquire
sense: 00094214-v
part of speech: verb
sense: 02215637-v

00094214-v
type: LexicalConcept
in scheme: en-word.net
definition: come to have or undergo a change of (physical features and attributes)
example: He grew a beard
example: The patient developed abdominal pains
example: I got funny spots all over my body
example: Well-developed breasts
ili: i22243
lexfile: verb.body
part of speech: verb
hypernym: 00109468-v
similar: 00546637-v

make-v
type: LexicalEntry
canonical form: make
sense: 00120124-v
part of speech: verb
sense: 00772482-v
sense: 02360592-v

00120124-v
type: LexicalConcept
in scheme: en-word.net
definition: give certain properties to something
example: get someone mad
example: She made us look silly
example: He made a fool of himself at the meeting
example: Don't make this into a big deal
example: This invention will make you a millionaire
example: Make yourself clear
ili: i22361
lexfile: verb.change
part of speech: verb
hypernym: 00126072-v

let-v
type: LexicalEntry
canonical form: let
sense: 00120604-v
part of speech: verb

00120604-v
type: LexicalConcept
in scheme: en-word.net
definition: cause to move; cause to be in a certain position or condition
example: He got his squad on the ball
example: This let me in for a big surprise
example: He got a girl into trouble
ili: i22363
lexfile: verb.change
part of speech: verb
hypernym: 00120124-v

become-v
type: LexicalEntry
canonical form: become
sense: 00149403-v
part of speech: verb

go-v
type: LexicalEntry
canonical form: go
sense: 00149403-v
part of speech: verb

00149403-v
type: LexicalConcept
in scheme: en-word.net
definition: enter or assume a certain state or condition
example: He became annoyed when he heard the bad news
example: It must be getting more serious
example: her face went red with anger
example: She went into ecstasy
example: Get going!
ili: i22460
lexfile: verb.change
part of speech: verb
hypernym: 00145958-v

get down-v
type: LexicalEntry
canonical form: get down
sense: 00346415-v
part of speech: verb

begin-v
type: LexicalEntry
canonical form: begin
sense: 00346415-v
part of speech: verb

start out-v
type: LexicalEntry
canonical form: start out
sense: 00346415-v
part of speech: verb

start-v
type: LexicalEntry
canonical form: start
sense: 00346415-v
part of speech: verb

set about-v
type: LexicalEntry
canonical form: set about
sense: 00346415-v
part of speech: verb

set out-v
type: LexicalEntry
canonical form: set out
sense: 00346415-v
part of speech: verb

commence-v
type: LexicalEntry
canonical form: commence
sense: 00346415-v
part of speech: verb

00346415-v
type: LexicalConcept
in scheme: en-word.net
definition: take the first step or steps in carrying out an action
example: We began working at dawn
example: Who will start?
example: Get working as soon as the sun rises!
example: The first tourists began to arrive in Cambodia
example: He began early in the day
example: Let's get down to work now
ili: i23466
lexfile: verb.change
part of speech: verb
hypernym: 02372362-v
similar: 01072799-v

receive-v
type: LexicalEntry
canonical form: receive
sense: 00523831-v
part of speech: verb
sense: 02112480-v
sense: 02113108-v

find-v
type: LexicalEntry
canonical form: find
sense: 00523831-v
part of speech: verb

obtain-v
type: LexicalEntry
canonical form: obtain
sense: 00523831-v
part of speech: verb

incur-v
type: LexicalEntry
canonical form: incur
sense: 00523831-v
part of speech: verb

00523831-v
type: LexicalConcept
in scheme: en-word.net
definition: receive a specified treatment (abstract)
example: These aspects of civilization do not find expression or receive an interpretation
example: His movie received a good review
example: I got nothing but trouble for my good intentions
ili: i24333
lexfile: verb.change
part of speech: verb
hypernym: 00109468-v
similar: 02215637-v

get-n
type: LexicalEntry
canonical form: get
sense: 00568933-n
part of speech: noun

00568933-n
type: LexicalConcept
in scheme: en-word.net
definition: a return on a shot that seemed impossible to reach and would normally have resulted in a point for the opponent
ili: i38377
lexfile: noun.act
part of speech: noun
hypernym: 00567335-n

catch-v
type: LexicalEntry
canonical form: catch
sense: 00591299-v
part of speech: verb
sense: 01217985-v
sense: 01403769-v
sense: 01508590-v
sense: 01741988-v
sense: 02114099-v
sense: 02193844-v

00591299-v
type: LexicalConcept
in scheme: en-word.net
definition: grasp with the mind or develop an understanding of
example: did you catch that allusion?
example: We caught something of his theory in the lecture
example: don't catch your meaning
example: did you get it?
example: She didn't get the joke
example: I just don't get him
ili: i24714
lexfile: verb.cognition
part of speech: verb
hypernym: 00590283-v
similar: 01741988-v
similar: 02364339-v

perplex-v
type: LexicalEntry
canonical form: perplex
sense: 00624056-v
part of speech: verb

vex-v
type: LexicalEntry
canonical form: vex
sense: 00624056-v
part of speech: verb

stick-v
type: LexicalEntry
canonical form: stick
sense: 00624056-v
part of speech: verb

puzzle-v
type: LexicalEntry
canonical form: puzzle
sense: 00624056-v
part of speech: verb

mystify-v
type: LexicalEntry
canonical form: mystify
sense: 00624056-v
part of speech: verb

baffle-v
type: LexicalEntry
canonical form: baffle
sense: 00624056-v
part of speech: verb

beat-v
type: LexicalEntry
canonical form: beat
sense: 00624056-v
part of speech: verb

pose-v
type: LexicalEntry
canonical form: pose
sense: 00624056-v
part of speech: verb

bewilder-v
type: LexicalEntry
canonical form: bewilder
sense: 00624056-v
part of speech: verb

flummox-v
type: LexicalEntry
canonical form: flummox
sense: 00624056-v
part of speech: verb

stupefy-v
type: LexicalEntry
canonical form: stupefy
sense: 00624056-v
part of speech: verb

nonplus-v
type: LexicalEntry
canonical form: nonplus
sense: 00624056-v
part of speech: verb

gravel-v
type: LexicalEntry
canonical form: gravel
sense: 00624056-v
part of speech: verb

amaze-v
type: LexicalEntry
canonical form: amaze
sense: 00624056-v
part of speech: verb

dumbfound-v
type: LexicalEntry
canonical form: dumbfound
sense: 00624056-v
part of speech: verb

00624056-v
type: LexicalConcept
in scheme: en-word.net
definition: be a mystery or bewildering to
example: This beats me!
example: Got me — I don't know the answer!
example: a vexing problem
example: This question really stuck me
ili: i24864
lexfile: verb.cognition
part of speech: verb
hypernym: 00623406-v

00641511-v
type: LexicalConcept
in scheme: en-word.net
definition: reach by calculation
example: What do you get when you add up these numbers?
ili: i24934
lexfile: verb.cognition
part of speech: verb
entails: 00638921-v
hypernym: 02024442-v
similar: 02364339-v

induce-v
type: LexicalEntry
canonical form: induce
sense: 00772482-v
part of speech: verb

stimulate-v
type: LexicalEntry
canonical form: stimulate
sense: 00772482-v
part of speech: verb

cause-v
type: LexicalEntry
canonical form: cause
sense: 00772482-v
part of speech: verb

00772482-v
type: LexicalConcept
in scheme: en-word.net
definition: cause to do; cause to act in a specified manner
example: The ads induced me to buy a VCR
example: My children finally got me to buy a computer
example: My wife made me buy a new sofa
ili: i25546
lexfile: verb.communication
part of speech: verb
hypernym: 02372362-v

drive-v
type: LexicalEntry
canonical form: drive
sense: 01028984-v
part of speech: verb

aim-v
type: LexicalEntry
canonical form: aim
sense: 01028984-v
part of speech: verb

01028984-v
type: LexicalConcept
in scheme: en-word.net
definition: move into a desired direction of discourse
example: What are you driving at?
ili: i26709
lexfile: verb.communication
part of speech: verb
hypernym: 00957180-v

01068058-v
type: LexicalConcept
in scheme: en-word.net
definition: communicate with a place or person; establish communication with, as if by telephone
example: Bill called this number and he got Mary
example: The operator couldn't get Kobe because of the earthquake
ili: i26918
lexfile: verb.communication
part of speech: verb
hypernym: 00742582-v

pay back-v
type: LexicalEntry
canonical form: pay back
sense: 01156413-v
part of speech: verb

pay off-v
type: LexicalEntry
canonical form: pay off
sense: 01156413-v
part of speech: verb

fix-v
type: LexicalEntry
canonical form: fix
sense: 01156413-v
part of speech: verb

01156413-v
type: LexicalConcept
in scheme: en-word.net
definition: take vengeance on or get even
example: We'll get them!
example: That'll fix him good!
example: This time I got him
ili: i27393
lexfile: verb.competition
part of speech: verb
hypernym: 01156228-v
similar: 02349239-v

capture-v
type: LexicalEntry
canonical form: capture
sense: 01217985-v
part of speech: verb

01217985-v
type: LexicalConcept
in scheme: en-word.net
definition: succeed in catching or seizing, especially after a chase
example: We finally got the suspect
example: Did you catch the thief?
ili: i27699
lexfile: verb.contact
part of speech: verb
hypernym: 01215136-v

01403769-v
type: LexicalConcept
in scheme: en-word.net
definition: reach with a blow or hit in a particular spot
example: the rock caught her in the back of the head
example: The blow got him in the back
example: The punch caught him in the stomach
ili: i28726
lexfile: verb.contact
part of speech: verb
hypernym: 01402698-v

bring-v
type: LexicalEntry
canonical form: bring
sense: 01435927-v
part of speech: verb

convey-v
type: LexicalEntry
canonical form: convey
sense: 01435927-v
part of speech: verb

fetch-v
type: LexicalEntry
canonical form: fetch
sense: 01435927-v
part of speech: verb

01435927-v
type: LexicalConcept
in scheme: en-word.net
definition: go or come after and bring or take back
example: Get me those books over there, please
example: Could you bring the wine?
example: The dog fetched the hat
ili: i28895
lexfile: verb.contact
part of speech: verb
entails: 01853188-v
hypernym: 01438013-v
similar: 02081903-v

arrest-v
type: LexicalEntry
canonical form: arrest
sense: 01508590-v
part of speech: verb

01508590-v
type: LexicalConcept
in scheme: en-word.net
definition: attract and fix
example: His look caught her
example: She caught his eye
example: Catch the attention of the waiter
ili: i29253
lexfile: verb.contact
part of speech: verb
hypernym: 01507886-v

01567992-v
type: LexicalConcept
in scheme: en-word.net
definition: overcome or destroy
example: The ice storm got my hibiscus
example: the cat got the goldfish
ili: i29555
lexfile: verb.contact
part of speech: verb
hypernym: 01566925-v

draw-v
type: LexicalEntry
canonical form: draw
sense: 01646839-v
part of speech: verb

01646839-v
type: LexicalConcept
in scheme: en-word.net
definition: earn or achieve a base by being walked by the pitcher
example: He drew a base on balls
ili: i29955
lexfile: verb.creation
part of speech: verb
domain topic: 00472688-n
hypernym: 01646466-v

01741988-v
type: LexicalConcept
in scheme: en-word.net
definition: apprehend and reproduce accurately
example: She really caught the spirit of the place in her drawings
example: She got the mood just right in her photographs
ili: i30428
lexfile: verb.creation
part of speech: verb
hypernym: 01741022-v
similar: 00591299-v

01774960-v
type: LexicalConcept
in scheme: en-word.net
definition: evoke an emotional response
example: Brahms's ‘Requiem’ gets me every time
ili: i30592
lexfile: verb.emotion
part of speech: verb
hypernym: 01774723-v
similar: 01775115-v

get under one's skin-v
type: LexicalEntry
canonical form: get under one's skin
sense: 01775115-v
part of speech: verb

01775115-v
type: LexicalConcept
in scheme: en-word.net
definition: irritate
example: Her childish behavior really gets to me
example: His lying really gets me
ili: i30593
lexfile: verb.emotion
part of speech: verb
hypernym: 01791774-v
similar: 01774960-v

arrive-v
type: LexicalEntry
canonical form: arrive
sense: 02009962-v
part of speech: verb

come-v
type: LexicalEntry
canonical form: come
sense: 02009962-v
part of speech: verb

02009962-v
type: LexicalConcept
in scheme: en-word.net
definition: reach a destination; arrive by movement or progress
example: She arrived home at 7 o'clock
example: She didn't get to Chicago until after midnight
ili: i31766
lexfile: verb.motion
part of speech: verb
hypernym: 02024442-v
similar: 02010587-v

02010587-v
type: LexicalConcept
in scheme: en-word.net
definition: reach and board
example: She got the bus just as it was leaving
ili: i31768
lexfile: verb.motion
part of speech: verb
hypernym: 02022224-v
similar: 02009962-v

scram-v
type: LexicalEntry
canonical form: scram
sense: 02014716-v
part of speech: verb

buzz off-v
type: LexicalEntry
canonical form: buzz off
sense: 02014716-v
part of speech: verb

fuck off-v
type: LexicalEntry
canonical form: fuck off
sense: 02014716-v
part of speech: verb

bugger off-v
type: LexicalEntry
canonical form: bugger off
sense: 02014716-v
part of speech: verb

02014716-v
type: LexicalConcept
in scheme: en-word.net
definition: leave immediately; used usually in the imperative form
example: Scram!
ili: i31791
lexfile: verb.motion
part of speech: verb
hypernym: 02013448-v

experience-v
type: LexicalEntry
canonical form: experience
sense: 02112480-v
part of speech: verb

02112480-v
type: LexicalConcept
in scheme: en-word.net
definition: go through (mental or physical states or experiences)
example: get an idea
example: experience vertigo
example: get nauseous
example: receive injuries
example: have a feeling
ili: i32302
lexfile: verb.perception
part of speech: verb
entails: 02110960-v
hypernym: 02112831-v

02113108-v
type: LexicalConcept
in scheme: en-word.net
definition: receive as a retribution or punishment
example: He got 5 years in prison
ili: i32304
lexfile: verb.perception
part of speech: verb
hypernym: 02214901-v
similar: 02114099-v

02114099-v
type: LexicalConcept
in scheme: en-word.net
definition: suffer from the receipt of
example: She will catch hell for this behavior!
ili: i32309
lexfile: verb.perception
part of speech: verb
hypernym: 00064841-v
similar: 00544096-v
similar: 02113108-v

02193844-v
type: LexicalConcept
in scheme: en-word.net
definition: perceive by hearing
example: I didn't catch your name
example: She didn't get his name when they met the first time
ili: i32701
lexfile: verb.perception
part of speech: verb
hypernym: 02174146-v
similar: 02193614-v

02213047-v
type: LexicalConcept
in scheme: en-word.net
definition: purchase
example: What did you get at the toy store?
ili: i32791
lexfile: verb.possession
part of speech: verb
domain topic: 01092370-n
hypernym: 02211988-v

02215637-v
type: LexicalConcept
in scheme: en-word.net
definition: come into the possession of something concrete or abstract
example: She got a lot of paintings from her uncle
example: They acquired a new pet
example: Get your results the next day
example: Get permission to take a few days off from work
ili: i32803
lexfile: verb.possession
part of speech: verb
hypernym: 02372362-v
similar: 00523831-v

02360592-v
type: LexicalConcept
in scheme: en-word.net
definition: achieve a point or goal
example: Nicklaus had a 70
example: The Brazilian team got 4 goals
example: She made 29 points that day
ili: i33526
lexfile: verb.possession
part of speech: verb
hypernym: 01114241-v
similar: 00012260-v

02364339-v
type: LexicalConcept
in scheme: en-word.net
definition: acquire as a result of some effort or action
example: You cannot get water out of a stone
example: Where did she get these news?
ili: i33548
lexfile: verb.possession
part of speech: verb
hypernym: 02215637-v
similar: 00641511-v
similar: 00591299-v