Populus-n
type: LexicalEntry
canonical form: Populus
sense: 12751962-n
part of speech: noun

genus Populus-n
type: LexicalEntry
canonical form: genus Populus
sense: 12751962-n
part of speech: noun

12751962-n
type: LexicalConcept
in scheme: en-word.net
definition: a genus of trees of the family Salicaceae that is found in the Northern Hemisphere; poplars
ili: i103744
lexfile: noun.plant
part of speech: noun
hypernym: 11593624-n
mero member: 12752161-n