Crataegus-n
type: LexicalEntry
canonical form: Crataegus
sense: 12646791-n
part of speech: noun

genus Crataegus-n
type: LexicalEntry
canonical form: genus Crataegus
sense: 12646791-n
part of speech: noun

12646791-n
type: LexicalConcept
in scheme: en-word.net
definition: thorny shrubs and small trees: hawthorn; thorn; thorn apple
ili: i103235
lexfile: noun.plant
part of speech: noun
hypernym: 11605791-n
mero member: 12647114-n
mero member: 12647435-n
mero member: 12647639-n
mero member: 12647880-n
mero member: 12648108-n
mero member: 12648287-n
mero member: 12648511-n
mero member: 12648821-n
mero member: 12649117-n