familial-a
type: LexicalEntry
canonical form: familial
sense: 01317491-s
part of speech: adjective

genetic-a
type: LexicalEntry
canonical form: genetic
sense: 01317491-s
part of speech: adjective
sense: https://en-word.net/lemma/genetic-a#02744928-a
sense: https://en-word.net/lemma/genetic-a#02745127-a
sense: https://en-word.net/lemma/genetic-a#02745280-a

hereditary-a
type: LexicalEntry
canonical form: hereditary
sense: 01317491-s
part of speech: adjective

inherited-a
type: LexicalEntry
canonical form: inherited
sense: 01317491-s
part of speech: adjective

transmitted-a
type: LexicalEntry
canonical form: transmitted
sense: 01317491-s
part of speech: adjective

transmissible-a
type: LexicalEntry
canonical form: transmissible
sense: 01317491-s
part of speech: adjective

01317491-s
type: LexicalConcept
in scheme: en-word.net
definition: occurring among members of a family usually by heredity
example: an inherited disease
example: familial traits
example: genetically transmitted features
ili: i7161
lexfile: adj.all
part of speech: adjective satellite
similar: https://en-word.net/synset/01316883-a

genetical-a
type: LexicalEntry
canonical form: genetical
sense: https://en-word.net/lemma/genetical-a#02744928-a
part of speech: adjective
sense: https://en-word.net/lemma/genetical-a#02745280-a

https://en-word.net/synset/02744928-a
type: LexicalConcept
in scheme: en-word.net
definition: of or relating to the science of genetics
example: genetic research
ili: i15385
lexfile: adj.pert
part of speech: adjective

https://en-word.net/synset/02745127-a
type: LexicalConcept
in scheme: en-word.net
definition: pertaining to or referring to origin
example: genetic history reconstructs the origins of a literary work
ili: i15386
lexfile: adj.pert
part of speech: adjective

genic-a
type: LexicalEntry
canonical form: genic
sense: https://en-word.net/lemma/genic-a#02745280-a
part of speech: adjective

https://en-word.net/synset/02745280-a
type: LexicalConcept
in scheme: en-word.net
definition: of or relating to or produced by or being a gene
example: genic combinations
example: genetic code
ili: i15387
lexfile: adj.pert
part of speech: adjective