G-n
type: LexicalEntry
canonical form: G
sense: 06844869-n
part of speech: noun

g-n
type: LexicalEntry
canonical form: g
sense: 06844869-n
part of speech: noun
sense: 13670214-n
sense: 13745822-n

06844869-n
type: LexicalConcept
in scheme: en-word.net
definition: the 7th letter of the Roman alphabet
ili: i72392
lexfile: noun.communication
part of speech: noun
hypernym: 06841868-n

gee-n
type: LexicalEntry
canonical form: gee
sense: 13670214-n
part of speech: noun

g-force-n
type: LexicalEntry
canonical form: g-force
sense: 13670214-n
part of speech: noun

13670214-n
type: LexicalConcept
in scheme: en-word.net
definition: a unit of force equal to the force exerted by gravity; used to indicate the force to which a body is subjected when it is accelerated
ili: i108431
lexfile: noun.quantity
part of speech: noun
hypernym: 13624308-n

gram-n
type: LexicalEntry
canonical form: gram
sense: 13745822-n
part of speech: noun

gramme-n
type: LexicalEntry
canonical form: gramme
sense: 13745822-n
part of speech: noun

gm-n
type: LexicalEntry
canonical form: gm
sense: 13745822-n
part of speech: noun

13745822-n
type: LexicalConcept
in scheme: en-word.net
definition: a metric unit of weight equal to one thousandth of a kilogram
ili: i108977
lexfile: noun.quantity
part of speech: noun
hypernym: 13739260-n
mero part: 13740556-n
mero part: 13745687-n