furnishing-n
type: LexicalEntry
canonical form: furnishing
sense: 00609736-n
part of speech: noun
sense: 03410175-n
sense: 03410505-n

00609736-n
type: LexicalConcept
in scheme: en-word.net
definition: the act of providing a house or room with furniture and other removable items such as shelves, carpets, appliances, etc.
ili: i38623
lexfile: noun.act
part of speech: noun
hypernym: 00609469-n

03410175-n
type: LexicalConcept
in scheme: en-word.net
definition: (usually plural) the instrumentalities (furniture and appliances and other movable accessories including curtains and rugs) that make a home (or other area) livable
ili: i54109
lexfile: noun.artifact
part of speech: noun
exemplifies: 06306016-n
hypernym: 03580409-n

trappings-n
type: LexicalEntry
canonical form: trappings
sense: 03410505-n
part of speech: noun

03410505-n
type: LexicalConcept
in scheme: en-word.net
definition: (usually plural) accessory wearing apparel
ili: i54110
lexfile: noun.artifact
part of speech: noun
exemplifies: 06306016-n
hypernym: 02674410-n