fucoid-n
type: LexicalEntry
canonical form: fucoid
sense: 01407006-n
part of speech: noun
sense: 01407136-n

fucoid algae-n
type: LexicalEntry
canonical form: fucoid algae
sense: 01407006-n
part of speech: noun

01407006-n
type: LexicalConcept
in scheme: en-word.net
definition: any of various algae of the family Fucaceae
ili: i42705
lexfile: noun.animal
part of speech: noun
hypernym: 01405241-n

01407136-n
type: LexicalConcept
in scheme: en-word.net
definition: a fossilized cast or impression of algae of the order Fucales
ili: i42706
lexfile: noun.animal
part of speech: noun
hypernym: 09307495-n