shape-n
type: LexicalEntry
canonical form: shape
sense: 00028005-n
part of speech: noun
sense: 04684871-n
sense: 05071206-n
sense: 05224424-n
sense: 05939522-n

form-n
type: LexicalEntry
canonical form: form
sense: 00028005-n
part of speech: noun
sense: 03389381-n
sense: 03723460-n
sense: 04684871-n
sense: 04937655-n
sense: 05071206-n
sense: 05207938-n
sense: 05224424-n
sense: 05847533-n
sense: 05939522-n
sense: 06301417-n
sense: 06485234-n
sense: 07106984-n
sense: 08128123-n
sense: 08255384-n
sense: 14503649-n

00028005-n
type: LexicalConcept
in scheme: en-word.net
definition: the spatial arrangement of something as distinct from its substance
example: geometry is the mathematical science of shape
ili: i35581
lexfile: noun.Tops
part of speech: noun
hypernym: 00024444-n

shape-v
type: LexicalEntry
canonical form: shape
sense: 00142011-v
part of speech: verb
sense: 01663142-v

form-v
type: LexicalEntry
canonical form: form
sense: 00142011-v
part of speech: verb
sense: 00144670-v
sense: 01663142-v
sense: 02435769-v
sense: 02453050-v
sense: 02627475-v
sense: 02629987-v

00142011-v
type: LexicalConcept
in scheme: en-word.net
definition: give shape or form to
example: shape the dough
example: form the young child's character
ili: i22428
lexfile: verb.change
part of speech: verb
hypernym: 00126072-v

00144670-v
type: LexicalConcept
in scheme: en-word.net
definition: assume a form or shape
example: the water formed little beads
ili: i22442
lexfile: verb.change
part of speech: verb
hypernym: 00109468-v

work-v
type: LexicalEntry
canonical form: work
sense: 01663142-v
part of speech: verb

mold-v
type: LexicalEntry
canonical form: mold
sense: 01663142-v
part of speech: verb

mould-v
type: LexicalEntry
canonical form: mould
sense: 01663142-v
part of speech: verb

forge-v
type: LexicalEntry
canonical form: forge
sense: 01663142-v
part of speech: verb

01663142-v
type: LexicalConcept
in scheme: en-word.net
definition: make something, usually for a specific function
example: She molded the rice balls carefully
example: Form cylinders from the dough
example: shape a figure
example: Work the metal into a sword
ili: i30030
lexfile: verb.creation
part of speech: verb
hypernym: 01656555-v
similar: 01672498-v

imprint-v
type: LexicalEntry
canonical form: imprint
sense: 02435769-v
part of speech: verb

02435769-v
type: LexicalConcept
in scheme: en-word.net
definition: establish or impress firmly in the mind
example: We imprint our ideas onto our children
ili: i33884
lexfile: verb.social
part of speech: verb
hypernym: 02542223-v

organize-v
type: LexicalEntry
canonical form: organize
sense: 02453050-v
part of speech: verb

organise-v
type: LexicalEntry
canonical form: organise
sense: 02453050-v
part of speech: verb

02453050-v
type: LexicalConcept
in scheme: en-word.net
definition: create (as an entity)
example: social groups form everywhere
example: They formed a company
ili: i33966
lexfile: verb.social
part of speech: verb
hypernym: 01620211-v

constitute-v
type: LexicalEntry
canonical form: constitute
sense: 02627475-v
part of speech: verb

make-v
type: LexicalEntry
canonical form: make
sense: 02627475-v
part of speech: verb

02627475-v
type: LexicalConcept
in scheme: en-word.net
definition: to compose or represent
example: This wall forms the background of the stage setting
example: The branches made a roof
example: This makes a fine introduction
ili: i34780
lexfile: verb.stative
part of speech: verb
hypernym: 02626667-v

take form-v
type: LexicalEntry
canonical form: take form
sense: 02629987-v
part of speech: verb

take shape-v
type: LexicalEntry
canonical form: take shape
sense: 02629987-v
part of speech: verb

spring-v
type: LexicalEntry
canonical form: spring
sense: 02629987-v
part of speech: verb

02629987-v
type: LexicalConcept
in scheme: en-word.net
definition: develop into a distinctive entity
example: our plans began to take shape
ili: i34792
lexfile: verb.stative
part of speech: verb
hypernym: 02629610-v

03389381-n
type: LexicalConcept
in scheme: en-word.net
definition: a mold for setting concrete
example: they built elaborate forms for pouring the foundation
ili: i53990
lexfile: noun.artifact
part of speech: noun
hypernym: 03784903-n

mannequin-n
type: LexicalEntry
canonical form: mannequin
sense: 03723460-n
part of speech: noun

manikin-n
type: LexicalEntry
canonical form: manikin
sense: 03723460-n
part of speech: noun

mannikin-n
type: LexicalEntry
canonical form: mannikin
sense: 03723460-n
part of speech: noun

manakin-n
type: LexicalEntry
canonical form: manakin
sense: 03723460-n
part of speech: noun

03723460-n
type: LexicalConcept
in scheme: en-word.net
definition: a life-size dummy used to display clothes
ili: i55990
lexfile: noun.artifact
part of speech: noun
hypernym: 03260351-n

cast-n
type: LexicalEntry
canonical form: cast
sense: 04684871-n
part of speech: noun

04684871-n
type: LexicalConcept
in scheme: en-word.net
definition: the visual appearance of something or someone
example: the delicate cast of his features
ili: i61635
lexfile: noun.attribute
part of speech: noun
hypernym: 04681322-n

04937655-n
type: LexicalConcept
in scheme: en-word.net
definition: a particular mode in which something is manifested
example: his resentment took the form of extreme hostility
ili: i62892
lexfile: noun.attribute
part of speech: noun
hypernym: 04936080-n

configuration-n
type: LexicalEntry
canonical form: configuration
sense: 05071206-n
part of speech: noun

contour-n
type: LexicalEntry
canonical form: contour
sense: 05071206-n
part of speech: noun

conformation-n
type: LexicalEntry
canonical form: conformation
sense: 05071206-n
part of speech: noun

05071206-n
type: LexicalConcept
in scheme: en-word.net
definition: any spatial attributes (especially as defined by outline)
example: he could barely make out their shapes
ili: i63608
lexfile: noun.attribute
part of speech: noun
attribute: https://en-word.net/synset/02318575-a
attribute: https://en-word.net/synset/02319224-a
hypernym: 05069917-n

05207938-n
type: LexicalConcept
in scheme: en-word.net
definition: an ability to perform well
example: he was at the top of his form
example: the team was off form last night
ili: i64299
lexfile: noun.attribute
part of speech: noun
hypernym: 05207437-n

human body-n
type: LexicalEntry
canonical form: human body
sense: 05224424-n
part of speech: noun

physical body-n
type: LexicalEntry
canonical form: physical body
sense: 05224424-n
part of speech: noun

material body-n
type: LexicalEntry
canonical form: material body
sense: 05224424-n
part of speech: noun

soma-n
type: LexicalEntry
canonical form: soma
sense: 05224424-n
part of speech: noun

build-n
type: LexicalEntry
canonical form: build
sense: 05224424-n
part of speech: noun

figure-n
type: LexicalEntry
canonical form: figure
sense: 05224424-n
part of speech: noun

physique-n
type: LexicalEntry
canonical form: physique
sense: 05224424-n
part of speech: noun

anatomy-n
type: LexicalEntry
canonical form: anatomy
sense: 05224424-n
part of speech: noun

bod-n
type: LexicalEntry
canonical form: bod
sense: 05224424-n
part of speech: noun

chassis-n
type: LexicalEntry
canonical form: chassis
sense: 05224424-n
part of speech: noun

frame-n
type: LexicalEntry
canonical form: frame
sense: 05224424-n
part of speech: noun

flesh-n
type: LexicalEntry
canonical form: flesh
sense: 05224424-n
part of speech: noun

05224424-n
type: LexicalConcept
in scheme: en-word.net
definition: alternative names for the body of a human being
example: Leonardo studied the human body
example: he has a strong physique
example: the spirit is willing but the flesh is weak
ili: i64383
lexfile: noun.body
part of speech: noun
hypernym: 05223633-n

kind-n
type: LexicalEntry
canonical form: kind
sense: 05847533-n
part of speech: noun

sort-n
type: LexicalEntry
canonical form: sort
sense: 05847533-n
part of speech: noun

variety-n
type: LexicalEntry
canonical form: variety
sense: 05847533-n
part of speech: noun

05847533-n
type: LexicalConcept
in scheme: en-word.net
definition: a category of things distinguished by some common characteristic or quality
example: sculpture is a form of art
example: what kinds of desserts are there?
ili: i67559
lexfile: noun.cognition
part of speech: noun
hypernym: 05847274-n

pattern-n
type: LexicalEntry
canonical form: pattern
sense: 05939522-n
part of speech: noun

05939522-n
type: LexicalConcept
in scheme: en-word.net
definition: a perceptual structure
example: the composition presents problems for students of musical form
example: a visual pattern must include not only objects but the spaces between them
ili: i67998
lexfile: noun.cognition
part of speech: noun
hypernym: 05734290-n

word form-n
type: LexicalEntry
canonical form: word form
sense: 06301417-n
part of speech: noun

signifier-n
type: LexicalEntry
canonical form: signifier
sense: 06301417-n
part of speech: noun

descriptor-n
type: LexicalEntry
canonical form: descriptor
sense: 06301417-n
part of speech: noun

06301417-n
type: LexicalConcept
in scheme: en-word.net
definition: the phonological or orthographic sound or appearance of a word that can be used to describe or identify something
example: the inflected forms of a word can be represented by a stem and a list of inflections to be attached
ili: i69559
lexfile: noun.communication
part of speech: noun
domain topic: 06182505-n
hypernym: 06297048-n

06485234-n
type: LexicalConcept
in scheme: en-word.net
definition: a printed document with spaces in which to write
example: he filled out his tax form
ili: i70475
lexfile: noun.communication
part of speech: noun
hypernym: 06481744-n
mero part: 06401196-n

07106984-n
type: LexicalConcept
in scheme: en-word.net
definition: an arrangement of the elements in a composition or discourse
example: the essay was in the form of a dialogue
example: he first sketches the plot in outline form
ili: i73923
lexfile: noun.communication
part of speech: noun
hypernym: 07106786-n

variant-n
type: LexicalEntry
canonical form: variant
sense: 08128123-n
part of speech: noun

strain-n
type: LexicalEntry
canonical form: strain
sense: 08128123-n
part of speech: noun

var.-n
type: LexicalEntry
canonical form: var.
sense: 08128123-n
part of speech: noun

08128123-n
type: LexicalConcept
in scheme: en-word.net
definition: (biology) a group of organisms within a species that differ in trivial ways from similar groups
example: a new strain of microorganisms
ili: i79808
lexfile: noun.group
part of speech: noun
domain topic: 06047178-n
hypernym: 08008892-n

class-n
type: LexicalEntry
canonical form: class
sense: 08255384-n
part of speech: noun

grade-n
type: LexicalEntry
canonical form: grade
sense: 08255384-n
part of speech: noun

course-n
type: LexicalEntry
canonical form: course
sense: 08255384-n
part of speech: noun

08255384-n
type: LexicalConcept
in scheme: en-word.net
definition: a body of students who are taught together
example: early morning classes are always sleepy
ili: i80413
lexfile: noun.group
part of speech: noun
hypernym: 07991473-n

phase-n
type: LexicalEntry
canonical form: phase
sense: 14503649-n
part of speech: noun

14503649-n
type: LexicalConcept
in scheme: en-word.net
definition: (physical chemistry) a distinct state of matter in a system; matter that is identical in chemical composition and physical state and separated from other material by the phase boundary
example: the reaction occurs in the liquid phase of the system
ili: i113098
lexfile: noun.state
part of speech: noun
domain topic: 06099035-n
hypernym: 14503199-n