foreground-v
type: LexicalEntry
canonical form: foreground
sense: 00515150-v
part of speech: verb

highlight-v
type: LexicalEntry
canonical form: highlight
sense: 00515150-v
part of speech: verb

spotlight-v
type: LexicalEntry
canonical form: spotlight
sense: 00515150-v
part of speech: verb

play up-v
type: LexicalEntry
canonical form: play up
sense: 00515150-v
part of speech: verb

00515150-v
type: LexicalConcept
in scheme: en-word.net
definition: move into the foreground to make more visible or prominent
example: The introduction highlighted the speaker's distinguished career in linguistics
ili: i24289
lexfile: verb.change
part of speech: verb
hypernym: 00515544-v

foreground-n
type: LexicalEntry
canonical form: foreground
sense: 03387554-n
part of speech: noun
sense: 05943014-n

03387554-n
type: LexicalConcept
in scheme: en-word.net
definition: (computer science) a window for an active application
ili: i53977
lexfile: noun.artifact
part of speech: noun
domain topic: 06138021-n
hypernym: 04596042-n

05943014-n
type: LexicalConcept
in scheme: en-word.net
definition: the part of a scene that is near the viewer
ili: i68016
lexfile: noun.cognition
part of speech: noun
hypernym: 05941982-n