football-n
type: LexicalEntry
canonical form: football
sense: 00469555-n
part of speech: noun

football game-n
type: LexicalEntry
canonical form: football game
sense: 00469555-n
part of speech: noun

00469555-n
type: LexicalConcept
in scheme: en-word.net
definition: any of various games played with a ball (round or oval) in which two teams try to kick or carry or propel the ball into each other's goal
ili: i37873
lexfile: noun.act
part of speech: noun
hypernym: 00468787-n
hypernym: 00434398-n
mero part: 15282640-n