foliate-a
type: LexicalEntry
canonical form: foliate
sense: 00210039-s
part of speech: adjective

foliated-a
type: LexicalEntry
canonical form: foliated
sense: 00210039-s
part of speech: adjective

foliaceous-a
type: LexicalEntry
canonical form: foliaceous
sense: 00210039-s
part of speech: adjective
sense: 01705864-s
sense: https://en-word.net/lemma/foliaceous-a#02740838-a

00210039-s
type: LexicalConcept
in scheme: en-word.net
definition: (especially of metamorphic rock) having thin leaflike layers or strata
ili: i1129
lexfile: adj.all
part of speech: adjective satellite
similar: https://en-word.net/synset/00209821-a

foliose-a
type: LexicalEntry
canonical form: foliose
sense: 01705864-s
part of speech: adjective

foliaged-a
type: LexicalEntry
canonical form: foliaged
sense: 01705864-s
part of speech: adjective

01705864-s
type: LexicalConcept
in scheme: en-word.net
definition: bearing numerous leaves
ili: i9319
lexfile: adj.all
part of speech: adjective satellite
similar: https://en-word.net/synset/01704867-a

https://en-word.net/synset/02740838-a
type: LexicalConcept
in scheme: en-word.net
definition: of or pertaining to or resembling the leaf of a plant
ili: i15356
lexfile: adj.pert
part of speech: adjective