fluster-v
type: LexicalEntry
canonical form: fluster
sense: 01794412-v
part of speech: verb
sense: 01796002-v

01794412-v
type: LexicalConcept
in scheme: en-word.net
definition: cause to be nervous or upset
ili: i30683
lexfile: verb.emotion
part of speech: verb
causes: 01796002-v
hypernym: 01794768-v

01796002-v
type: LexicalConcept
in scheme: en-word.net
definition: be flustered; behave in a confused manner
ili: i30691
lexfile: verb.emotion
part of speech: verb
hypernym: 00010428-v

perturbation-n
type: LexicalEntry
canonical form: perturbation
sense: 04912173-n
part of speech: noun

fluster-n
type: LexicalEntry
canonical form: fluster
sense: 04912173-n
part of speech: noun

04912173-n
type: LexicalConcept
in scheme: en-word.net
definition: a disposition that is confused or nervous and upset
ili: i62764
lexfile: noun.attribute
part of speech: noun
hypernym: 04911841-n