blinker-n
type: LexicalEntry
canonical form: blinker
sense: 02855432-n
part of speech: noun

flasher-n
type: LexicalEntry
canonical form: flasher
sense: 02855432-n
part of speech: noun
sense: 03363687-n
sense: 10090749-n

02855432-n
type: LexicalConcept
in scheme: en-word.net
definition: a light that flashes on and off; used as a signal or to send messages
ili: i50849
lexfile: noun.artifact
part of speech: noun
hypernym: 03670692-n

03363687-n
type: LexicalConcept
in scheme: en-word.net
definition: an electrical device that automatically turns a lamp on and off (as for an advertising display)
ili: i53820
lexfile: noun.artifact
part of speech: noun
hypernym: 03274312-n

exhibitionist-n
type: LexicalEntry
canonical form: exhibitionist
sense: 10090749-n
part of speech: noun

10090749-n
type: LexicalConcept
in scheme: en-word.net
definition: someone with a compulsive desire to expose the genitals
ili: i89843
lexfile: noun.person
part of speech: noun
hypernym: 09969936-n