fire-eater-n
type: LexicalEntry
canonical form: fire-eater
sense: 10111219-n
part of speech: noun
sense: 10111333-n
sense: 10111420-n

fire-swallower-n
type: LexicalEntry
canonical form: fire-swallower
sense: 10111219-n
part of speech: noun

10111219-n
type: LexicalConcept
in scheme: en-word.net
definition: a performer who pretends to swallow fire
ili: i89958
lexfile: noun.person
part of speech: noun
hypernym: 10435383-n

hothead-n
type: LexicalEntry
canonical form: hothead
sense: 10111333-n
part of speech: noun

10111333-n
type: LexicalConcept
in scheme: en-word.net
definition: a belligerent grouch
ili: i89959
lexfile: noun.person
part of speech: noun
exemplifies: 06730109-n
hypernym: 10167825-n

firefighter-n
type: LexicalEntry
canonical form: firefighter
sense: 10111420-n
part of speech: noun

fire fighter-n
type: LexicalEntry
canonical form: fire fighter
sense: 10111420-n
part of speech: noun

10111420-n
type: LexicalConcept
in scheme: en-word.net
definition: a member of a fire department who tries to extinguish fires
ili: i89960
lexfile: noun.person
part of speech: noun
hypernym: 09637714-n