fabrication-n
type: LexicalEntry
canonical form: fabrication
sense: 00932855-n
part of speech: noun

fictionalization-n
type: LexicalEntry
canonical form: fictionalization
sense: 00932855-n
part of speech: noun
sense: 06378818-n

fictionalisation-n
type: LexicalEntry
canonical form: fictionalisation
sense: 00932855-n
part of speech: noun
sense: 06378818-n

00932855-n
type: LexicalConcept
in scheme: en-word.net
definition: writing in a fictional form
ili: i40300
lexfile: noun.act
part of speech: noun
hypernym: 00931533-n

06378818-n
type: LexicalConcept
in scheme: en-word.net
definition: a literary work based partly or wholly on fact but written as if it were fiction
ili: i69936
lexfile: noun.communication
part of speech: noun
hypernym: 06375736-n