ferry-n
type: LexicalEntry
canonical form: ferry
sense: 03334608-n
part of speech: noun

ferryboat-n
type: LexicalEntry
canonical form: ferryboat
sense: 03334608-n
part of speech: noun

03334608-n
type: LexicalConcept
in scheme: en-word.net
definition: a boat that transports people or vehicles across a body of water and operates on a regular schedule
ili: i53644
lexfile: noun.artifact
part of speech: noun
hypernym: 02861626-n