ferret out-v
type: LexicalEntry
canonical form: ferret out
sense: 00723989-v
part of speech: verb

ferret-v
type: LexicalEntry
canonical form: ferret
sense: 00723989-v
part of speech: verb

00723989-v
type: LexicalConcept
in scheme: en-word.net
definition: search and discover through persistent investigation
example: She ferreted out the truth
ili: i25311
lexfile: verb.cognition
part of speech: verb
hypernym: 01641524-v