femininity-n
type: LexicalEntry
canonical form: femininity
sense: 04674763-n
part of speech: noun

muliebrity-n
type: LexicalEntry
canonical form: muliebrity
sense: 04674763-n
part of speech: noun

04674763-n
type: LexicalConcept
in scheme: en-word.net
definition: the trait of behaving in ways considered typical for women
ili: i61592
lexfile: noun.attribute
part of speech: noun
hypernym: 04623416-n