companion-n
type: LexicalEntry
canonical form: companion
sense: 09965757-n
part of speech: noun

fellow traveler-n
type: LexicalEntry
canonical form: fellow traveler
sense: 09965757-n
part of speech: noun
sense: 10103446-n

fellow traveller-n
type: LexicalEntry
canonical form: fellow traveller
sense: 09965757-n
part of speech: noun
sense: 10103446-n

09965757-n
type: LexicalConcept
in scheme: en-word.net
definition: a traveler who accompanies you
ili: i89127
lexfile: noun.person
part of speech: noun
hypernym: 09652940-n

10103446-n
type: LexicalConcept
in scheme: en-word.net
definition: a communist sympathizer (but not a member of the Communist Party)
ili: i89919
lexfile: noun.person
part of speech: noun
hypernym: 10705556-n