federate-v
type: LexicalEntry
canonical form: federate
sense: 00369847-v
part of speech: verb
sense: 00370095-v

federalize-v
type: LexicalEntry
canonical form: federalize
sense: 00369847-v
part of speech: verb
sense: 00370095-v

federalise-v
type: LexicalEntry
canonical form: federalise
sense: 00369847-v
part of speech: verb
sense: 00370095-v

00369847-v
type: LexicalConcept
in scheme: en-word.net
definition: unite on a federal basis or band together as a league
example: The country was federated after the civil war
ili: i23580
lexfile: verb.change
part of speech: verb
hypernym: 02475258-v

00370095-v
type: LexicalConcept
in scheme: en-word.net
definition: enter into a league for a common purpose
example: The republics federated to become the Soviet Union
ili: i23581
lexfile: verb.change
part of speech: verb
hypernym: 00368338-v

federate-a
type: LexicalEntry
canonical form: federate
sense: 02486932-s
part of speech: adjective

federated-a
type: LexicalEntry
canonical form: federated
sense: 02486932-s
part of speech: adjective

02486932-s
type: LexicalConcept
in scheme: en-word.net
definition: united under a central government
ili: i13731
lexfile: adj.all
part of speech: adjective satellite
similar: https://en-word.net/synset/02485330-a