federate-v
type: LexicalEntry
canonical form: federate
sense: 00369847-v
part of speech: verb
sense: 00370095-v

federalize-v
type: LexicalEntry
canonical form: federalize
sense: 00369847-v
part of speech: verb
sense: 00370095-v
sense: 00505545-v

federalise-v
type: LexicalEntry
canonical form: federalise
sense: 00369847-v
part of speech: verb
sense: 00370095-v
sense: 00505545-v

00369847-v
type: LexicalConcept
in scheme: en-word.net
definition: unite on a federal basis or band together as a league
example: The country was federated after the civil war
ili: i23580
lexfile: verb.change
part of speech: verb
hypernym: 02475258-v

00370095-v
type: LexicalConcept
in scheme: en-word.net
definition: enter into a league for a common purpose
example: The republics federated to become the Soviet Union
ili: i23581
lexfile: verb.change
part of speech: verb
hypernym: 00368338-v

00505545-v
type: LexicalConcept
in scheme: en-word.net
definition: put under the control and authority of a federal government
ili: i24233
lexfile: verb.change
part of speech: verb
hypernym: 00406465-v