lining-n
type: LexicalEntry
canonical form: lining
sense: 00829040-n
part of speech: noun

facing-n
type: LexicalEntry
canonical form: facing
sense: 00829040-n
part of speech: noun
sense: 03320589-n
sense: 03320750-n
sense: 03320935-n

00829040-n
type: LexicalConcept
in scheme: en-word.net
definition: providing something with a surface of a different material
ili: i39752
lexfile: noun.act
part of speech: noun
hypernym: 00713478-n

cladding-n
type: LexicalEntry
canonical form: cladding
sense: 03320589-n
part of speech: noun

03320589-n
type: LexicalConcept
in scheme: en-word.net
definition: a protective covering that protects the outside of a building
ili: i53559
lexfile: noun.artifact
part of speech: noun
hypernym: 04020673-n

03320750-n
type: LexicalConcept
in scheme: en-word.net
definition: a lining applied to the edge of a garment for ornamentation or strengthening
ili: i53560
lexfile: noun.artifact
part of speech: noun
hypernym: 03679093-n

veneer-n
type: LexicalEntry
canonical form: veneer
sense: 03320935-n
part of speech: noun

03320935-n
type: LexicalConcept
in scheme: en-word.net
definition: an ornamental coating to a building
ili: i53561
lexfile: noun.artifact
part of speech: noun
hypernym: 03062092-n