facade-n
type: LexicalEntry
canonical form: facade
sense: 03318278-n
part of speech: noun
sense: 06771409-n

frontage-n
type: LexicalEntry
canonical form: frontage
sense: 03318278-n
part of speech: noun

frontal-n
type: LexicalEntry
canonical form: frontal
sense: 03318278-n
part of speech: noun

03318278-n
type: LexicalConcept
in scheme: en-word.net
definition: the face or front of a building
ili: i53548
lexfile: noun.artifact
part of speech: noun
hypernym: 03403382-n

window dressing-n
type: LexicalEntry
canonical form: window dressing
sense: 06771409-n
part of speech: noun

06771409-n
type: LexicalConcept
in scheme: en-word.net
definition: a showy misrepresentation intended to conceal something unpleasant
ili: i72009
lexfile: noun.communication
part of speech: noun
hypernym: 06770936-n