legend-n
type: LexicalEntry
canonical form: legend
sense: 06383036-n
part of speech: noun

fable-n
type: LexicalEntry
canonical form: fable
sense: 06383036-n
part of speech: noun
sense: 06383718-n
sense: 06770602-n

06383036-n
type: LexicalConcept
in scheme: en-word.net
definition: a story about mythical or supernatural beings or events
ili: i69960
lexfile: noun.communication
part of speech: noun
hypernym: 06381452-n

parable-n
type: LexicalEntry
canonical form: parable
sense: 06383718-n
part of speech: noun

allegory-n
type: LexicalEntry
canonical form: allegory
sense: 06383718-n
part of speech: noun

apologue-n
type: LexicalEntry
canonical form: apologue
sense: 06383718-n
part of speech: noun

06383718-n
type: LexicalConcept
in scheme: en-word.net
definition: a short moral story (often with animal characters)
ili: i69963
lexfile: noun.communication
part of speech: noun
hypernym: 06381452-n

fabrication-n
type: LexicalEntry
canonical form: fabrication
sense: 06770602-n
part of speech: noun

fiction-n
type: LexicalEntry
canonical form: fiction
sense: 06770602-n
part of speech: noun

06770602-n
type: LexicalConcept
in scheme: en-word.net
definition: a deliberately false or improbable account
ili: i72005
lexfile: noun.communication
part of speech: noun
hypernym: 06769118-n