exhortation-n
type: LexicalEntry
canonical form: exhortation
sense: 07154408-n
part of speech: noun
sense: 07260696-n

07154408-n
type: LexicalConcept
in scheme: en-word.net
definition: a communication intended to urge or persuade the recipients to take some action
ili: i74183
lexfile: noun.communication
part of speech: noun
hypernym: 06262268-n

incitement-n
type: LexicalEntry
canonical form: incitement
sense: 07260696-n
part of speech: noun

07260696-n
type: LexicalConcept
in scheme: en-word.net
definition: the act of exhorting; an earnest attempt at persuasion
ili: i74749
lexfile: noun.communication
part of speech: noun
hypernym: 07259785-n